{"text_format":"1","workbook":"xlsx","n_sheets":7,"sheets":["DATOS","SUPUESTOS","P&G","BALANCE","FLUJO DE CAJA","KPI'S","DASHBOARD"],"not_rendered":{"charts":3,"images":0,"macros":1,"external_links":0,"defined_names":23,"comments":0,"pivot_tables":0},"unopened":[],"bounds":{"document_bytes":16777216,"sheet_cells":100000,"rows_first":2000,"rows_last":500,"rows_between":2000,"halvings":0,"cell_chars":16384,"cell_head_chars":4096},"cells_cut":0,"cells_raw":0,"read":"whole","date_system":"1900"}

{"sheet":"DATOS","index":0,"n_rows":21,"n_cols":12,"rows_kept":21,"cut":false,"hidden":false,"merged":[]}
[null,"Ingrese los siguientes datos:",null,null,"Variables resultantes:",null,null,null,null,null,null,"ROMA INVESTI"]
[]
[null,"Horizonte de proyecto (años)",5,null,"Costos Construcción/m2 inicial",{"$f":"+DATOS!C20*DATOS!C7","v":2378000}]
[null,"Terreno (m2)",500,null,"Área comercializable (m2)",{"$f":"+DATOS!C4*DATOS!C5*DATOS!C6","v":700}]
[null,"índice de construcción",2.8,null,"Volumen de ventas inicial",{"$f":"+DATOS!C20*DATOS!F4","v":2870000000}]
[null,"Factor de eficiencia",0.5,null,"Capital de inicio (Efectivo+PP&E+Intangibles)",{"$f":"+DATOS!F5*DATOS!C21","v":1004499999.9999999}]
[null,"Costos construcción  (% ventas)",0.57999999999999996]
[null,"Costo terreno (% ventas)",0.14000000000000001]
{"$rows_left_out":14}
{"sheet":"SUPUESTOS","index":1,"n_rows":62,"n_cols":12,"rows_kept":62,"cut":false,"hidden":true,"merged":[]}
[null,"Supuestos",null,null,null,null,null,null,null,null,null,"ROMA INVESTI"]
[]
[null,null,"Año 1","Año 2","Año 3","Año 4","Año 5"]
[null,"Costos estructuración",{"$f":"+IF(C3=\"\",\"\",IF(VALUE(RIGHT(C3,LEN(C3)-FIND(\" \",C3)))=1,DATOS!$C$9*DATOS!$F$5,0))","v":86100000},{"$f":"+IF(D3=\"\",\"\",IF(VALUE(RIGHT(D3,LEN(D3)-FIND(\" \",D3)))=1,DATOS!$C$9*DATOS!$F$5,0))","v":0},{"$f":"+IF(E3=\"\",\"\",IF(VALUE(RIGHT(E3,LEN(E3)-FIND(\" \",E3)))=1,DATOS!$C$9*DATOS!$F$5,0))","v":0},{"$f":"+IF(F3=\"\",\"\",IF(VALUE(RIGHT(F3,LEN(F3)-FIND(\" \",F3)))=1,DATOS!$C$9*DATOS!$F$5,0))","v":0},{"$f":"+IF(G3=\"\",\"\",IF(VALUE(RIGHT(G3,LEN(G3)-FIND(\" \",G3)))=1,DATOS!$C$9*DATOS!$F$5,0))","v":0},{"$f":"+IF(H3=\"\",\"\",IF(VALUE(RIGHT(H3,LEN(H3)-FIND(\" \",H3)))=1,DATOS!$C$9*DATOS!$F$5,0))","v":""},{"$f":"+IF(I3=\"\",\"\",IF(VALUE(RIGHT(I3,LEN(I3)-FIND(\" \",I3)))=1,DATOS!$C$9*DATOS!$F$5,0))","v":""},{"$f":"+IF(J3=\"\",\"\",IF(VALUE(RIGHT(J3,LEN(J3)-FIND(\" \",J3)))=1,DATOS!$C$9*DATOS!$F$5,0))","v":""},{"$f":"+IF(K3=\"\",\"\",IF(VALUE(RIGHT(K3,LEN(K3)-FIND(\" \",K3)))=1,DATOS!$C$9*DATOS!$F$5,0))","v":""},{"$f":"+IF(L3=\"\",\"\",IF(VALUE(RIGHT(L3,LEN(L3)-FIND(\" \",L3)))=1,DATOS!$C$9*DATOS!$F$5,0))","v":""}]
[null,"Costo terreno",{"$f":"+IF(C3=\"\",\"\",IF(VALUE(RIGHT(C3,LEN(C3)-FIND(\" \",C3)))=1,DATOS!$F$5*DATOS!$C$8,0))","v":401800000.00000006},{"$f":"+IF(D3=\"\",\"\",IF(VALUE(RIGHT(D3,LEN(D3)-FIND(\" \",D3)))=1,DATOS!$F$5*DATOS!$C$8,0))","v":0},{"$f":"+IF(E3=\"\",\"\",IF(VALUE(RIGHT(E3,LEN(E3)-FIND(\" \",E3)))=1,DATOS!$F$5*DATOS!$C$8,0))","v":0},{"$f":"+IF(F3=\"\",\"\",IF(VALUE(RIGHT(F3,LEN(F3)-FIND(\" \",F3)))=1,DATOS!$F$5*DATOS!$C$8,0))","v":0},{"$f":"+IF(G3=\"\",\"\",IF(VALUE(RIGHT(G3,LEN(G3)-FIND(\" \",G3)))=1,DATOS!$F$5*DATOS!$C$8,0))","v":0},{"$f":"+IF(H3=\"\",\"\",IF(VALUE(RIGHT(H3,LEN(H3)-FIND(\" \",H3)))=1,DATOS!$F$5*DATOS!$C$8,0))","v":""},{"$f":"+IF(I3=\"\",\"\",IF(VALUE(RIGHT(I3,LEN(I3)-FIND(\" \",I3)))=1,DATOS!$F$5*DATOS!$C$8,0))","v":""},{"$f":"+IF(J3=\"\",\"\",IF(VALUE(RIGHT(J3,LEN(J3)-FIND(\" \",J3)))=1,DATOS!$F$5*DATOS!$C$8,0))","v":""},{"$f":"+IF(K3=\"\",\"\",IF(VALUE(RIGHT(K3,LEN(K3)-FIND(\" \",K3)))=1,DATOS!$F$5*DATOS!$C$8,0))","v":""},{"$f":"+IF(L3=\"\",\"\",IF(VALUE(RIGHT(L3,LEN(L3)-FIND(\" \",L3)))=1,DATOS!$F$5*DATOS!$C$8,0))","v":""}]
[null,"Costos de licencias y permisos",{"$f":"+IF(C3=\"\",\"\",IF(VALUE(RIGHT(C3,LEN(C3)-FIND(\" \",C3)))=1,DATOS!$F$5*DATOS!$C$12,0))","v":57400000},{"$f":"+IF(D3=\"\",\"\",IF(VALUE(RIGHT(D3,LEN(D3)-FIND(\" \",D3)))=1,DATOS!$F$5*DATOS!$C$12,0))","v":0},{"$f":"+IF(E3=\"\",\"\",IF(VALUE(RIGHT(E3,LEN(E3)-FIND(\" \",E3)))=1,DATOS!$F$5*DATOS!$C$12,0))","v":0},{"$f":"+IF(F3=\"\",\"\",IF(VALUE(RIGHT(F3,LEN(F3)-FIND(\" \",F3)))=1,DATOS!$F$5*DATOS!$C$12,0))","v":0},{"$f":"+IF(G3=\"\",\"\",IF(VALUE(RIGHT(G3,LEN(G3)-FIND(\" \",G3)))=1,DATOS!$F$5*DATOS!$C$12,0))","v":0},{"$f":"+IF(H3=\"\",\"\",IF(VALUE(RIGHT(H3,LEN(H3)-FIND(\" \",H3)))=1,DATOS!$F$5*DATOS!$C$12,0))","v":""},{"$f":"+IF(I3=\"\",\"\",IF(VALUE(RIGHT(I3,LEN(I3)-FIND(\" \",I3)))=1,DATOS!$F$5*DATOS!$C$12,0))","v":""},{"$f":"+IF(J3=\"\",\"\",IF(VALUE(RIGHT(J3,LEN(J3)-FIND(\" \",J3)))=1,DATOS!$F$5*DATOS!$C$12,0))","v":""},{"$f":"+IF(K3=\"\",\"\",IF(VALUE(RIGHT(K3,LEN(K3)-FIND(\" \",K3)))=1,DATOS!$F$5*DATOS!$C$12,0))","v":""},{"$f":"+IF(L3=\"\",\"\",IF(VALUE(RIGHT(L3,LEN(L3)-FIND(\" \",L3)))=1,DATOS!$F$5*DATOS!$C$12,0))","v":""}]
[null,"Costos construcción/m2",{"$f":"IF(ISBLANK(C3),\"\",DATOS!$F$3*((1+SUPUESTOS!$C$61)^(MID(C3,5,3))))","v":2496900},{"$f":"IF(ISBLANK(D3),\"\",DATOS!$F$3*((1+SUPUESTOS!$C$61)^(MID(D3,5,3))))","v":2621745},{"$f":"IF(ISBLANK(E3),\"\",DATOS!$F$3*((1+SUPUESTOS!$C$61)^(MID(E3,5,3))))","v":2752832.2500000005},{"$f":"IF(ISBLANK(F3),\"\",DATOS!$F$3*((1+SUPUESTOS!$C$61)^(MID(F3,5,3))))","v":2890473.8624999998},{"$f":"IF(ISBLANK(G3),\"\",DATOS!$F$3*((1+SUPUESTOS!$C$61)^(MID(G3,5,3))))","v":3034997.5556250005},{"$f":"IF(ISBLANK(H3),\"\",DATOS!$F$3*((1+SUPUESTOS!$C$61)^(MID(H3,5,3))))","v":""},{"$f":"IF(ISBLANK(I3),\"\",DATOS!$F$3*((1+SUPUESTOS!$C$61)^(MID(I3,5,3))))","v":""},{"$f":"IF(ISBLANK(J3),\"\",DATOS!$F$3*((1+SUPUESTOS!$C$61)^(MID(J3,5,3))))","v":""},{"$f":"IF(ISBLANK(K3),\"\",DATOS!$F$3*((1+SUPUESTOS!$C$61)^(MID(K3,5,3))))","v":""},{"$f":"IF(ISBLANK(L3),\"\",DATOS!$F$3*((1+SUPUESTOS!$C$61)^(MID(L3,5,3))))","v":""}]
[null,"Indice avance construcción acumulado (Curva S)",{"$f":"+IF(C3=\"\",\"\",IF(VALUE(RIGHT(C3,LEN(C3)-FIND(\" \",C3)))>=DATOS!$C$18,((1/(1+EXP(-10*(((MID(C3,5,3)-DATOS!$C$18+1)/(DATOS!$C$3-DATOS!$C$18+1))-0.5))))-(1/(1+EXP(-10*(0-0.5)))))/((1/(1+EXP(-10*(1-0.5))))-(1/(1+EXP(-10*(0-0.5))))),0))","v":0},{"$f":"+IF(D3=\"\",\"\",IF(VALUE(RIGHT(D3,LEN(D3)-FIND(\" \",D3)))>=DATOS!$C$18,((1/(1+EXP(-10*(((MID(D3,5,3)-DATOS!$C$18+1)/(DATOS!$C$3-DATOS!$C$18+1))-0.5))))-(1/(1+EXP(-10*(0-0.5)))))/((1/(1+EXP(-10*(1-0.5))))-(1/(1+EXP(-10*(0-0.5))))),0))","v":7.0103716545108136E-2},{"$f":"+IF(E3=\"\",\"\",IF(VALUE(RIGHT(E3,LEN(E3)-FIND(\" \",E3)))>=DATOS!$C$18,((1/(1+EXP(-10*(((MID(E3,5,3)-DATOS!$C$18+1)/(DATOS!$C$3-DATOS!$C$18+1))-0.5))))-(1/(1+EXP(-10*(0-0.5)))))/((1/(1+EXP(-10*(1-0.5))))-(1/(1+EXP(-10*(0-0.5))))),0))","v":0.49999999999999994},{"$f":"+IF(F3=\"\",\"\",IF(VALUE(RIGHT(F3,LEN(F3)-FIND(\" \",F3)))>=DATOS!$C$18,((1/(1+EXP(-10*(((MID(F3,5,3)-DATOS!$C$18+1)/(DATOS!$C$3-DATOS!$C$18+1))-0.5))))-(1/(1+EXP(-10*(0-0.5)))))/((1/(1+EXP(-10*(1-0.5))))-(1/(1+EXP(-10*(0-0.5))))),0))","v":0.92989628345489184},{"$f":"+IF(G3=\"\",\"\",IF(VALUE(RIGHT(G3,LEN(G3)-FIND(\" \",G3)))>=DATOS!$C$18,((1/(1+EXP(-10*(((MID(G3,5,3)-DATOS!$C$18+1)/(DATOS!$C$3-DATOS!$C$18+1))-0.5))))-(1/(1+EXP(-10*(0-0.5)))))/((1/(1+EXP(-10*(1-0.5))))-(1/(1+EXP(-10*(0-0.5))))),0))","v":1},{"$f":"+IF(H3=\"\",\"\",IF(VALUE(RIGHT(H3,LEN(H3)-FIND(\" \",H3)))>=DATOS!$C$18,((1/(1+EXP(-10*(((MID(H3,5,3)-DATOS!$C$18+1)/(DATOS!$C$3-DATOS!$C$18+1))-0.5))))-(1/(1+EXP(-10*(0-0.5)))))/((1/(1+EXP(-10*(1-0.5))))-(1/(1+EXP(-10*(0-0.5))))),0))","v":""},{"$f":"+IF(I3=\"\",\"\",IF(VALUE(RIGHT(I3,LEN(I3)-FIND(\" \",I3)))>=DATOS!$C$18,((1/(1+EXP(-10*(((MID(I3,5,3)-DATOS!$C$18+1)/(DATOS!$C$3-DATOS!$C$18+1))-0.5))))-(1/(1+EXP(-10*(0-0.5)))))/((1/(1+EXP(-10*(1-0.5))))-(1/(1+EXP(-10*(0-0.5))))),0))","v":""},{"$f":"+IF(J3=\"\",\"\",IF(VALUE(RIGHT(J3,LEN(J3)-FIND(\" \",J3)))>=DATOS!$C$18,((1/(1+EXP(-10*(((MID(J3,5,3)-DATOS!$C$18+1)/(DATOS!$C$3-DATOS!$C$18+1))-0.5))))-(1/(1+EXP(-10*(0-0.5)))))/((1/(1+EXP(-10*(1-0.5))))-(1/(1+EXP(-10*(0-0.5))))),0))","v":""},{"$f":"+IF(K3=\"\",\"\",IF(VALUE(RIGHT(K3,LEN(K3)-FIND(\" \",K3)))>=DATOS!$C$18,((1/(1+EXP(-10*(((MID(K3,5,3)-DATOS!$C$18+1)/(DATOS!$C$3-DATOS!$C$18+1))-0.5))))-(1/(1+EXP(-10*(0-0.5)))))/((1/(1+EXP(-10*(1-0.5))))-(1/(1+EXP(-10*(0-0.5))))),0))","v":""},{"$f":"+IF(L3=\"\",\"\",IF(VALUE(RIGHT(L3,LEN(L3)-FIND(\" \",L3)))>=DATOS!$C$18,((1/(1+EXP(-10*(((MID(L3,5,3)-DATOS!$C$18+1)/(DATOS!$C$3-DATOS!$C$18+1))-0.5))))-(1/(1+EXP(-10*(0-0.5)))))/((1/(1+EXP(-10*(1-0.5))))-(1/(1+EXP(-10*(0-0.5))))),0))","v":""}]
{"$rows_left_out":55}
{"sheet":"P&G","index":2,"n_rows":19,"n_cols":12,"rows_kept":19,"cut":false,"hidden":false,"merged":[]}
[null,"ESTADO DE RESULTADOS INTEGRAL",null,null,null,null,null,null,null,null,null,"ROMA INVESTI"]
[]
[null,null,{"$f":"IF(SUPUESTOS!C3=\"\",\"\",SUPUESTOS!C3)","v":"Año 1"},{"$f":"IF(SUPUESTOS!D3=\"\",\"\",SUPUESTOS!D3)","v":"Año 2"},{"$f":"IF(SUPUESTOS!E3=\"\",\"\",SUPUESTOS!E3)","v":"Año 3"},{"$f":"IF(SUPUESTOS!F3=\"\",\"\",SUPUESTOS!F3)","v":"Año 4"},{"$f":"IF(SUPUESTOS!G3=\"\",\"\",SUPUESTOS!G3)","v":"Año 5"},{"$f":"IF(SUPUESTOS!H3=\"\",\"\",SUPUESTOS!H3)","v":""},{"$f":"IF(SUPUESTOS!I3=\"\",\"\",SUPUESTOS!I3)","v":""},{"$f":"IF(SUPUESTOS!J3=\"\",\"\",SUPUESTOS!J3)","v":""},{"$f":"IF(SUPUESTOS!K3=\"\",\"\",SUPUESTOS!K3)","v":""},{"$f":"IF(SUPUESTOS!L3=\"\",\"\",SUPUESTOS!L3)","v":""}]
[null,"(+) Ventas",{"$f":"+IF(C3=\"\",\"\",SUPUESTOS!C15)","v":0},{"$f":"+IF(D3=\"\",\"\",SUPUESTOS!D15)","v":322473200.00000006},{"$f":"+IF(E3=\"\",\"\",SUPUESTOS!E15)","v":341821592.00000006},{"$f":"+IF(F3=\"\",\"\",SUPUESTOS!F15)","v":362330887.5200001},{"$f":"+IF(G3=\"\",\"\",SUPUESTOS!G15)","v":2688495185.3984008},{"$f":"+IF(H3=\"\",\"\",SUPUESTOS!H15)","v":""},{"$f":"+IF(I3=\"\",\"\",SUPUESTOS!I15)","v":""},{"$f":"+IF(J3=\"\",\"\",SUPUESTOS!J15)","v":""},{"$f":"+IF(K3=\"\",\"\",SUPUESTOS!K15)","v":""},{"$f":"+IF(L3=\"\",\"\",SUPUESTOS!L15)","v":""}]
[null,"Total Ingresos",{"$f":"+IF(C3=\"\",\"\",C4)","v":0},322473200.00000006,341821592.00000006,362330887.5200001,2688495185.3984008,"","","","",""]
[null,"( - ) Costo Directo",{"$f":"+IF(C3=\"\",\"\",SUPUESTOS!C10+SUPUESTOS!C11)","v":0},{"$f":"+IF(D3=\"\",\"\",SUPUESTOS!D10+SUPUESTOS!D11)","v":141521432.61683699},{"$f":"+IF(E3=\"\",\"\",SUPUESTOS!E10+SUPUESTOS!E11)","v":911242912.00232124},{"$f":"+IF(F3=\"\",\"\",SUPUESTOS!F10+SUPUESTOS!F11)","v":956805057.60243714},{"$f":"+IF(G3=\"\",\"\",SUPUESTOS!G10+SUPUESTOS!G11)","v":163828748.43306598},{"$f":"+IF(H3=\"\",\"\",SUPUESTOS!H10+SUPUESTOS!H11)","v":""},{"$f":"+IF(I3=\"\",\"\",SUPUESTOS!I10+SUPUESTOS!I11)","v":""},{"$f":"+IF(J3=\"\",\"\",SUPUESTOS!J10+SUPUESTOS!J11)","v":""},{"$f":"+IF(K3=\"\",\"\",SUPUESTOS!K10+SUPUESTOS!K11)","v":""},{"$f":"+IF(L3=\"\",\"\",SUPUESTOS!L10+SUPUESTOS!L11)","v":""}]
[null,"( - ) Depreciaciones costo",{"$f":"+IF(C3=\"\",\"\",C6*SUPUESTOS!C27)","v":0},{"$f":"+IF(D3=\"\",\"\",D6*SUPUESTOS!D27)","v":235869.05436139501},{"$f":"+IF(E3=\"\",\"\",E6*SUPUESTOS!E27)","v":1518738.1866705355},{"$f":"+IF(F3=\"\",\"\",F6*SUPUESTOS!F27)","v":1594675.0960040621},{"$f":"+IF(G3=\"\",\"\",G6*SUPUESTOS!G27)","v":273047.91405511001},{"$f":"+IF(H3=\"\",\"\",H6*SUPUESTOS!H27)","v":""},{"$f":"+IF(I3=\"\",\"\",I6*SUPUESTOS!I27)","v":""},{"$f":"+IF(J3=\"\",\"\",J6*SUPUESTOS!J27)","v":""},{"$f":"+IF(K3=\"\",\"\",K6*SUPUESTOS!K27)","v":""},{"$f":"+IF(L3=\"\",\"\",L6*SUPUESTOS!L27)","v":""}]
[null,"( - ) Amortizaciones costo",{"$f":"++IF(C3=\"\",\"\",C6*SUPUESTOS!C28)","v":0},{"$f":"++IF(D3=\"\",\"\",D6*SUPUESTOS!D28)","v":0},{"$f":"++IF(E3=\"\",\"\",E6*SUPUESTOS!E28)","v":0},{"$f":"++IF(F3=\"\",\"\",F6*SUPUESTOS!F28)","v":0},{"$f":"++IF(G3=\"\",\"\",G6*SUPUESTOS!G28)","v":0},{"$f":"++IF(H3=\"\",\"\",H6*SUPUESTOS!H28)","v":""},{"$f":"++IF(I3=\"\",\"\",I6*SUPUESTOS!I28)","v":""},{"$f":"++IF(J3=\"\",\"\",J6*SUPUESTOS!J28)","v":""},{"$f":"++IF(K3=\"\",\"\",K6*SUPUESTOS!K28)","v":""},{"$f":"++IF(L3=\"\",\"\",L6*SUPUESTOS!L28)","v":""}]
{"$rows_left_out":12}
{"sheet":"BALANCE","index":3,"n_rows":53,"n_cols":12,"rows_kept":53,"cut":false,"hidden":false,"merged":[]}
[null,"ESTADO DE LA SITUACIÓN FINANCIERA",null,null,null,null,null,null,null,null,null,"ROMA INVESTI"]
[]
[null,null,{"$f":"+IF(SUPUESTOS!C3=\"\",\"\",SUPUESTOS!C3)","v":"Año 1"},{"$f":"+IF(SUPUESTOS!D3=\"\",\"\",SUPUESTOS!D3)","v":"Año 2"},{"$f":"+IF(SUPUESTOS!E3=\"\",\"\",SUPUESTOS!E3)","v":"Año 3"},{"$f":"+IF(SUPUESTOS!F3=\"\",\"\",SUPUESTOS!F3)","v":"Año 4"},{"$f":"+IF(SUPUESTOS!G3=\"\",\"\",SUPUESTOS!G3)","v":"Año 5"},{"$f":"+IF(SUPUESTOS!H3=\"\",\"\",SUPUESTOS!H3)","v":""},{"$f":"+IF(SUPUESTOS!I3=\"\",\"\",SUPUESTOS!I3)","v":""},{"$f":"+IF(SUPUESTOS!J3=\"\",\"\",SUPUESTOS!J3)","v":""},{"$f":"+IF(SUPUESTOS!K3=\"\",\"\",SUPUESTOS!K3)","v":""},{"$f":"+IF(SUPUESTOS!L3=\"\",\"\",SUPUESTOS!L3)","v":""}]
[null,"ACTIVO"]
[null,"Activo Corriente"]
[null,"Efectivo y equivalentes",{"$f":"+IF(C3=\"\",\"\",IF(VALUE(RIGHT(C3,LEN(C3)-FIND(\" \",C3)))=1,DATOS!$F$6*SUPUESTOS!C48+'FLUJO DE CAJA'!C36,BALANCE!B6+'FLUJO DE CAJA'!C36))","v":348390191.45522344},{"$f":"+IF(D3=\"\",\"\",IF(VALUE(RIGHT(D3,LEN(D3)-FIND(\" \",D3)))=1,DATOS!$F$6*SUPUESTOS!D53+'FLUJO DE CAJA'!D36,BALANCE!C6+'FLUJO DE CAJA'!D36))","v":853523297.55181503},{"$f":"+IF(E3=\"\",\"\",IF(VALUE(RIGHT(E3,LEN(E3)-FIND(\" \",E3)))=1,DATOS!$F$6*SUPUESTOS!E53+'FLUJO DE CAJA'!E36,BALANCE!D6+'FLUJO DE CAJA'!E36))","v":818801286.71444035},{"$f":"+IF(F3=\"\",\"\",IF(VALUE(RIGHT(F3,LEN(F3)-FIND(\" \",F3)))=1,DATOS!$F$6*SUPUESTOS!F53+'FLUJO DE CAJA'!F36,BALANCE!E6+'FLUJO DE CAJA'!F36))","v":210940508.91500449},{"$f":"+IF(G3=\"\",\"\",IF(VALUE(RIGHT(G3,LEN(G3)-FIND(\" \",G3)))=1,DATOS!$F$6*SUPUESTOS!G53+'FLUJO DE CAJA'!G36,BALANCE!F6+'FLUJO DE CAJA'!G36))","v":1710870100.0857971},{"$f":"+IF(H3=\"\",\"\",IF(VALUE(RIGHT(H3,LEN(H3)-FIND(\" \",H3)))=1,DATOS!$F$6*SUPUESTOS!H53+'FLUJO DE CAJA'!H36,BALANCE!G6+'FLUJO DE CAJA'!H36))","v":""},{"$f":"+IF(I3=\"\",\"\",IF(VALUE(RIGHT(I3,LEN(I3)-FIND(\" \",I3)))=1,DATOS!$F$6*SUPUESTOS!I53+'FLUJO DE CAJA'!I36,BALANCE!H6+'FLUJO DE CAJA'!I36))","v":""},{"$f":"+IF(J3=\"\",\"\",IF(VALUE(RIGHT(J3,LEN(J3)-FIND(\" \",J3)))=1,DATOS!$F$6*SUPUESTOS!J53+'FLUJO DE CAJA'!J36,BALANCE!I6+'FLUJO DE CAJA'!J36))","v":""},{"$f":"+IF(K3=\"\",\"\",IF(VALUE(RIGHT(K3,LEN(K3)-FIND(\" \",K3)))=1,DATOS!$F$6*SUPUESTOS!K53+'FLUJO DE CAJA'!K36,BALANCE!J6+'FLUJO DE CAJA'!K36))","v":""},{"$f":"+IF(L3=\"\",\"\",IF(VALUE(RIGHT(L3,LEN(L3)-FIND(\" \",L3)))=1,DATOS!$F$6*SUPUESTOS!L53+'FLUJO DE CAJA'!L36,BALANCE!K6+'FLUJO DE CAJA'!L36))","v":""}]
[null,"Excedentes (requerimientos) de efectivo",{"$f":"+IF(C3=\"\",\"\",0)","v":0},0,0,0,0,"","","","",""]
[null,"Deudores comerciales y otras cuentas por cobrar",{"$f":"IF(C3=\"\",\"\",('P&G'!C5/360)*SUPUESTOS!C40)","v":0},{"$f":"IF(D3=\"\",\"\",('P&G'!D5/360)*SUPUESTOS!D40)","v":26872766.666666672},{"$f":"IF(E3=\"\",\"\",('P&G'!E5/360)*SUPUESTOS!E40)","v":28485132.666666672},{"$f":"IF(F3=\"\",\"\",('P&G'!F5/360)*SUPUESTOS!F40)","v":30194240.626666676},{"$f":"IF(G3=\"\",\"\",('P&G'!G5/360)*SUPUESTOS!G40)","v":224041265.44986671},{"$f":"IF(H3=\"\",\"\",('P&G'!H5/360)*SUPUESTOS!H40)","v":""},{"$f":"IF(I3=\"\",\"\",('P&G'!I5/360)*SUPUESTOS!I40)","v":""},{"$f":"IF(J3=\"\",\"\",('P&G'!J5/360)*SUPUESTOS!J40)","v":""},{"$f":"IF(K3=\"\",\"\",('P&G'!K5/360)*SUPUESTOS!K40)","v":""},{"$f":"IF(L3=\"\",\"\",('P&G'!L5/360)*SUPUESTOS!L40)","v":""}]
{"$rows_left_out":46}
{"sheet":"FLUJO DE CAJA","index":4,"n_rows":38,"n_cols":12,"rows_kept":38,"cut":false,"hidden":false,"merged":[[22,0,34,0],[20,0,21,0]]}
[null,"ESTADO DE FLUJO DE CAJA",null,null,null,null,null,null,null,null,null,"ROMA INVESTI"]
[]
[null,null,{"$f":"+IF(SUPUESTOS!C3=\"\",\"\",SUPUESTOS!C3)","v":"Año 1"},{"$f":"+IF(SUPUESTOS!D3=\"\",\"\",SUPUESTOS!D3)","v":"Año 2"},{"$f":"+IF(SUPUESTOS!E3=\"\",\"\",SUPUESTOS!E3)","v":"Año 3"},{"$f":"+IF(SUPUESTOS!F3=\"\",\"\",SUPUESTOS!F3)","v":"Año 4"},{"$f":"+IF(SUPUESTOS!G3=\"\",\"\",SUPUESTOS!G3)","v":"Año 5"},{"$f":"+IF(SUPUESTOS!H3=\"\",\"\",SUPUESTOS!H3)","v":""},{"$f":"+IF(SUPUESTOS!I3=\"\",\"\",SUPUESTOS!I3)","v":""},{"$f":"+IF(SUPUESTOS!J3=\"\",\"\",SUPUESTOS!J3)","v":""},{"$f":"+IF(SUPUESTOS!K3=\"\",\"\",SUPUESTOS!K3)","v":""},{"$f":"+IF(SUPUESTOS!L3=\"\",\"\",SUPUESTOS!L3)","v":""}]
[null,"(=) NOPAT",{"$f":"+IF(C3=\"\",\"\",'P&G'!C13*(1-SUPUESTOS!$C$60))","v":-13620202.050000001},{"$f":"+IF(D3=\"\",\"\",'P&G'!D13*(1-SUPUESTOS!$C$60))","v":101695642.56221277},{"$f":"+IF(E3=\"\",\"\",'P&G'!E13*(1-SUPUESTOS!$C$60))","v":-402260188.05577368},{"$f":"+IF(F3=\"\",\"\",'P&G'!F13*(1-SUPUESTOS!$C$60))","v":-419913733.55807477},{"$f":"+IF(G3=\"\",\"\",'P&G'!G13*(1-SUPUESTOS!$C$60))","v":1549764920.6999359},{"$f":"+IF(H3=\"\",\"\",'P&G'!H13*(1-SUPUESTOS!$C$60))","v":""},{"$f":"+IF(I3=\"\",\"\",'P&G'!I13*(1-SUPUESTOS!$C$60))","v":""},{"$f":"+IF(J3=\"\",\"\",'P&G'!J13*(1-SUPUESTOS!$C$60))","v":""},{"$f":"+IF(K3=\"\",\"\",'P&G'!K13*(1-SUPUESTOS!$C$60))","v":""},{"$f":"+IF(L3=\"\",\"\",'P&G'!L13*(1-SUPUESTOS!$C$60))","v":""}]
[null,"(+) Depreciaciones",{"$f":"+IF(C3=\"\",\"\",'P&G'!C7+'P&G'!C11)","v":4018000},{"$f":"+IF(D3=\"\",\"\",'P&G'!D7+'P&G'!D11)","v":3852069.0543613951},{"$f":"+IF(E3=\"\",\"\",'P&G'!E7+'P&G'!E11)","v":4773318.1866705352},{"$f":"+IF(F3=\"\",\"\",'P&G'!F7+'P&G'!F11)","v":4523797.0960040623},{"$f":"+IF(G3=\"\",\"\",'P&G'!G7+'P&G'!G11)","v":2909257.714055107},{"$f":"+IF(H3=\"\",\"\",'P&G'!H7+'P&G'!H11)","v":""},{"$f":"+IF(I3=\"\",\"\",'P&G'!I7+'P&G'!I11)","v":""},{"$f":"+IF(J3=\"\",\"\",'P&G'!J7+'P&G'!J11)","v":""},{"$f":"+IF(K3=\"\",\"\",'P&G'!K7+'P&G'!K11)","v":""},{"$f":"+IF(L3=\"\",\"\",'P&G'!L7+'P&G'!L11)","v":""}]
[null,"(+) Amortizaciones",{"$f":"+IF(C3=\"\",\"\",'P&G'!C8+'P&G'!C12)","v":502250},{"$f":"+IF(D3=\"\",\"\",'P&G'!D8+'P&G'!D12)","v":477137.5},{"$f":"+IF(E3=\"\",\"\",'P&G'!E8+'P&G'!E12)","v":453280.625},{"$f":"+IF(F3=\"\",\"\",'P&G'!F8+'P&G'!F12)","v":430616.59375},{"$f":"+IF(G3=\"\",\"\",'P&G'!G8+'P&G'!G12)","v":409085.76406250056},{"$f":"+IF(H3=\"\",\"\",'P&G'!H8+'P&G'!H12)","v":""},{"$f":"+IF(I3=\"\",\"\",'P&G'!I8+'P&G'!I12)","v":""},{"$f":"+IF(J3=\"\",\"\",'P&G'!J8+'P&G'!J12)","v":""},{"$f":"+IF(K3=\"\",\"\",'P&G'!K8+'P&G'!K12)","v":""},{"$f":"+IF(L3=\"\",\"\",'P&G'!L8+'P&G'!L12)","v":""}]
[null,"(=) Flujo de Caja Bruto",{"$f":"IF(C3=\"\",\"\",C4+C5+C6)","v":-9099952.0500000007},106024849.11657415,-397033589.24410313,-414959319.8683207,1553083264.1780534,"","","","",""]
[null,"(-) Incremento en cartera",{"$f":"+IF(C3=\"\",\"\",IF(VALUE(RIGHT(C3,LEN(C3)-FIND(\" \",C3)))=1,BALANCE!C8,BALANCE!C8-BALANCE!B8))","v":0},{"$f":"+IF(D3=\"\",\"\",IF(VALUE(RIGHT(D3,LEN(D3)-FIND(\" \",D3)))=1,BALANCE!D8,BALANCE!D8-BALANCE!C8))","v":26872766.666666672},{"$f":"+IF(E3=\"\",\"\",IF(VALUE(RIGHT(E3,LEN(E3)-FIND(\" \",E3)))=1,BALANCE!E8,BALANCE!E8-BALANCE!D8))","v":1612366},{"$f":"+IF(F3=\"\",\"\",IF(VALUE(RIGHT(F3,LEN(F3)-FIND(\" \",F3)))=1,BALANCE!F8,BALANCE!F8-BALANCE!E8))","v":1709107.9600000046},{"$f":"+IF(G3=\"\",\"\",IF(VALUE(RIGHT(G3,LEN(G3)-FIND(\" \",G3)))=1,BALANCE!G8,BALANCE!G8-BALANCE!F8))","v":193847024.82320005},{"$f":"+IF(H3=\"\",\"\",IF(VALUE(RIGHT(H3,LEN(H3)-FIND(\" \",H3)))=1,BALANCE!H8,BALANCE!H8-BALANCE!G8))","v":""},{"$f":"+IF(I3=\"\",\"\",IF(VALUE(RIGHT(I3,LEN(I3)-FIND(\" \",I3)))=1,BALANCE!I8,BALANCE!I8-BALANCE!H8))","v":""},{"$f":"+IF(J3=\"\",\"\",IF(VALUE(RIGHT(J3,LEN(J3)-FIND(\" \",J3)))=1,BALANCE!J8,BALANCE!J8-BALANCE!I8))","v":""},{"$f":"+IF(K3=\"\",\"\",IF(VALUE(RIGHT(K3,LEN(K3)-FIND(\" \",K3)))=1,BALANCE!K8,BALANCE!K8-BALANCE!J8))","v":""},{"$f":"+IF(L3=\"\",\"\",IF(VALUE(RIGHT(L3,LEN(L3)-FIND(\" \",L3)))=1,BALANCE!L8,BALANCE!L8-BALANCE!K8))","v":""}]
{"$rows_left_out":31}
{"sheet":"KPI'S","index":5,"n_rows":29,"n_cols":122,"rows_kept":29,"cut":false,"hidden":false,"merged":[]}
[null,"KPI'S",null,null,null,null,null,null,null,null,null,"ROMA INVESTI"]
[]
[null,null,{"$f":"+IF(SUPUESTOS!C3=\"\",\"\",SUPUESTOS!C3)","v":"Año 1"},{"$f":"+IF(SUPUESTOS!D3=\"\",\"\",SUPUESTOS!D3)","v":"Año 2"},{"$f":"+IF(SUPUESTOS!E3=\"\",\"\",SUPUESTOS!E3)","v":"Año 3"},{"$f":"+IF(SUPUESTOS!F3=\"\",\"\",SUPUESTOS!F3)","v":"Año 4"},{"$f":"+IF(SUPUESTOS!G3=\"\",\"\",SUPUESTOS!G3)","v":"Año 5"},{"$f":"+IF(SUPUESTOS!H3=\"\",\"\",SUPUESTOS!H3)","v":""},{"$f":"+IF(SUPUESTOS!I3=\"\",\"\",SUPUESTOS!I3)","v":""},{"$f":"+IF(SUPUESTOS!J3=\"\",\"\",SUPUESTOS!J3)","v":""},{"$f":"+IF(SUPUESTOS!K3=\"\",\"\",SUPUESTOS!K3)","v":""},{"$f":"+IF(SUPUESTOS!L3=\"\",\"\",SUPUESTOS!L3)","v":""}]
[null,"Avance acumulado (Curva S)",{"$f":"+IF(C3=\"\",\"\",SUPUESTOS!C8)","v":0},{"$f":"+IF(D3=\"\",\"\",SUPUESTOS!D8)","v":7.0103716545108136E-2},{"$f":"+IF(E3=\"\",\"\",SUPUESTOS!E8)","v":0.49999999999999994},{"$f":"+IF(F3=\"\",\"\",SUPUESTOS!F8)","v":0.92989628345489184},{"$f":"+IF(G3=\"\",\"\",SUPUESTOS!G8)","v":1},{"$f":"+IF(H3=\"\",\"\",SUPUESTOS!H8)","v":""},{"$f":"+IF(I3=\"\",\"\",SUPUESTOS!I8)","v":""},{"$f":"+IF(J3=\"\",\"\",SUPUESTOS!J8)","v":""},{"$f":"+IF(K3=\"\",\"\",SUPUESTOS!K8)","v":""},{"$f":"+IF(L3=\"\",\"\",SUPUESTOS!L8)","v":""}]
[null,"Terreno",{"$f":"+IF(C3=\"\",\"\",SUPUESTOS!C5)","v":401800000.00000006},{"$f":"+IF(D3=\"\",\"\",SUPUESTOS!D5)","v":0},{"$f":"+IF(E3=\"\",\"\",SUPUESTOS!E5)","v":0},{"$f":"+IF(F3=\"\",\"\",SUPUESTOS!F5)","v":0},{"$f":"+IF(G3=\"\",\"\",SUPUESTOS!G5)","v":0},{"$f":"+IF(H3=\"\",\"\",SUPUESTOS!H5)","v":""},{"$f":"+IF(I3=\"\",\"\",SUPUESTOS!I5)","v":""},{"$f":"+IF(J3=\"\",\"\",SUPUESTOS!J5)","v":""},{"$f":"+IF(K3=\"\",\"\",SUPUESTOS!K5)","v":""},{"$f":"+IF(L3=\"\",\"\",SUPUESTOS!L5)","v":""}]
[null,"Estructuración",{"$f":"+IF(C3=\"\",\"\",SUPUESTOS!C4)","v":86100000},{"$f":"+IF(D3=\"\",\"\",SUPUESTOS!D4)","v":0},{"$f":"+IF(E3=\"\",\"\",SUPUESTOS!E4)","v":0},{"$f":"+IF(F3=\"\",\"\",SUPUESTOS!F4)","v":0},{"$f":"+IF(G3=\"\",\"\",SUPUESTOS!G4)","v":0},{"$f":"+IF(H3=\"\",\"\",SUPUESTOS!H4)","v":""},{"$f":"+IF(I3=\"\",\"\",SUPUESTOS!I4)","v":""},{"$f":"+IF(J3=\"\",\"\",SUPUESTOS!J4)","v":""},{"$f":"+IF(K3=\"\",\"\",SUPUESTOS!K4)","v":""},{"$f":"+IF(L3=\"\",\"\",SUPUESTOS!L4)","v":""}]
[null,"Licencias y permisos",{"$f":"+IF(C3=\"\",\"\",SUPUESTOS!C6)","v":57400000},{"$f":"+IF(D3=\"\",\"\",SUPUESTOS!D6)","v":0},{"$f":"+IF(E3=\"\",\"\",SUPUESTOS!E6)","v":0},{"$f":"+IF(F3=\"\",\"\",SUPUESTOS!F6)","v":0},{"$f":"+IF(G3=\"\",\"\",SUPUESTOS!G6)","v":0},{"$f":"+IF(H3=\"\",\"\",SUPUESTOS!H6)","v":""},{"$f":"+IF(I3=\"\",\"\",SUPUESTOS!I6)","v":""},{"$f":"+IF(J3=\"\",\"\",SUPUESTOS!J6)","v":""},{"$f":"+IF(K3=\"\",\"\",SUPUESTOS!K6)","v":""},{"$f":"+IF(L3=\"\",\"\",SUPUESTOS!L6)","v":""}]
[null,"Fiducia",{"$f":"+IF(C3=\"\",\"\",SUPUESTOS!C12)","v":16433907},{"$f":"+IF(D3=\"\",\"\",SUPUESTOS!D12)","v":4785754.4777051089},{"$f":"+IF(E3=\"\",\"\",SUPUESTOS!E12)","v":27909019.025721636},{"$f":"+IF(F3=\"\",\"\",SUPUESTOS!F12)","v":29309361.443989232},{"$f":"+IF(G3=\"\",\"\",SUPUESTOS!G12)","v":8853148.9899658412},{"$f":"+IF(H3=\"\",\"\",SUPUESTOS!H12)","v":""},{"$f":"+IF(I3=\"\",\"\",SUPUESTOS!I12)","v":""},{"$f":"+IF(J3=\"\",\"\",SUPUESTOS!J12)","v":""},{"$f":"+IF(K3=\"\",\"\",SUPUESTOS!K12)","v":""},{"$f":"+IF(L3=\"\",\"\",SUPUESTOS!L12)","v":""}]
{"$rows_left_out":22}
{"sheet":"DASHBOARD","index":6,"n_rows":9,"n_cols":10,"rows_kept":9,"cut":false,"hidden":false,"merged":[[4,1,4,3],[5,1,5,3],[4,5,4,7],[5,5,5,7],[4,9,4,11],[5,9,5,11],[7,1,7,3],[8,1,8,3],[7,5,7,7],[8,5,8,7],[7,9,7,11],[8,9,8,11]]}
[null,"DASHBOARD"]
[null,"DASHBOARD"]
[]
[null,"INDICADORES CLAVE"]
[null,"TIR (E.A)",null,null,null,"VPN",null,null,null,{"$f":"\"EBITDA (AÑO \"&DATOS!C3&\")\"","v":"EBITDA (AÑO 5)"}]
[null,{"$f":"+'KPI''S'!C28","v":0.36546111059821174},null,null,null,{"$f":"+'KPI''S'!C29","v":255968355.80174157},null,null,null,{"$f":"INDEX('KPI''S'!20:20,2+DATOS!C3)","v":2387572067.6318655}]
[]
[null,"MARGEN EBITDA",null,null,null,"MARGEN NETO",null,null,null,"ROE (E.A)"]
{"$rows_left_out":1}